Target
Phosphotransferase
Ligand
BDBM61980
Substrate
Meas. Tech.
Confirmation assay for inhibitors of Trypanosoma brucei hexokinase 1-Analogue-first series
IC50
17921.66667±n/a nM
Citation
 PubChem, PC Confirmation assay for inhibitors of Trypanosoma brucei hexokinase 1-Analogue-first series PubChem Bioassay (2010)[AID] 
Target
Name:
Phosphotransferase
Synonyms:
hexokinase
Type:
Enzyme Catalytic Domain
Mol. Mass.:
51160.00
Organism:
Trypanosoma brucei
Description:
gi_70832125
Residue:
471
  
Inhibitor
Name:
BDBM61980
Synonyms:
4-chloranyl-2-[(3-methoxyphenyl)carbonylamino]benzoic acid 4-chloro-2-[(3-methoxybenzoyl)amino]benzoic acid KSC-6-259 cid_2233523
Type:
Small organic molecule
Emp. Form.:
C15H12ClNO4
Mol. Mass.:
305.713
SMILES:
COc1cccc(c1)C(=O)Nc1cc(Cl)ccc1C(O)=O
: