Target
Neuropeptides B/W receptor type 1
Ligand
BDBM62070
Substrate
Meas. Tech.
Fluorescence-based dose response cell-based high throughput screening assay to identify antagonists of the G-protein coupled receptor 7 (GPR7).
IC50
43807±n/a nM
Citation
 PubChem, PC Fluorescence-based dose response cell-based high throughput screening assay to identify antagonists of the G-protein coupled receptor 7 (GPR7). PubChem Bioassay (2010)[AID] 
Target
Name:
Neuropeptides B/W receptor type 1
Synonyms:
GPR7 NPBWR1 | neuropeptides B/W receptor 1
Type:
Enzyme Catalytic Domain
Mol. Mass.:
36111.82
Organism:
Homo sapiens (Human)
Description:
gi_119607128
Residue:
328
  
Inhibitor
Name:
BDBM62070
Synonyms:
5-(2-chlorophenyl)-2-[4-(2H-tetrazol-5-yl)benzyl]tetrazole 5-(2-chlorophenyl)-2-[[4-(2H-tetrazol-5-yl)phenyl]methyl]tetrazole MLS000065959 cid_2222207
Type:
Small organic molecule
Emp. Form.:
C15H11ClN8
Mol. Mass.:
338.754
SMILES:
Clc1ccccc1-c1nnn(Cc2ccc(cc2)-c2nnn[nH]2)n1
: