Target
Neuropeptides B/W receptor type 1
Ligand
BDBM62078
Substrate
Meas. Tech.
Fluorescence-based dose response cell-based high throughput screening assay to identify antagonists of the G-protein coupled receptor 7 (GPR7).
IC50
43807±n/a nM
Citation
 PubChem, PC Fluorescence-based dose response cell-based high throughput screening assay to identify antagonists of the G-protein coupled receptor 7 (GPR7). PubChem Bioassay (2010)[AID] 
Target
Name:
Neuropeptides B/W receptor type 1
Synonyms:
GPR7 NPBWR1 | neuropeptides B/W receptor 1
Type:
Enzyme Catalytic Domain
Mol. Mass.:
36111.82
Organism:
Homo sapiens (Human)
Description:
gi_119607128
Residue:
328
  
Inhibitor
Name:
BDBM62078
Synonyms:
(5-{4-[(Thiophen-2-ylmethyl)-sulfamoyl]-phenyl}-[1,3,4]oxadiazol-2-ylsulfanyl)-acetic acid ethyl ester 2-[[5-[4-(thiophen-2-ylmethylsulfamoyl)phenyl]-1,3,4-oxadiazol-2-yl]thio]acetic acid ethyl ester SMR000123955 ethyl 2-[[5-[4-(thiophen-2-ylmethylsulfamoyl)phenyl]-1,3,4-oxadiazol-2-yl]sulfanyl]acetate | ethyl 2-[[5-[4-(thiophen-2-ylmethylsulfamoyl)phenyl]-1,3,4-oxadiazol-2-yl]sulfanyl]ethanoate
Type:
Small organic molecule
Emp. Form.:
C17H17N3O5S3
Mol. Mass.:
439.529
SMILES:
CCOC(=O)CSc1nnc(o1)-c1ccc(cc1)S(=O)(=O)NCc1cccs1
: