Target
Neuropeptides B/W receptor type 1
Ligand
BDBM42429
Substrate
Meas. Tech.
Fluorescence-based dose response cell-based high throughput screening assay to identify antagonists of the G-protein coupled receptor 7 (GPR7).
IC50
31168±n/a nM
Citation
 PubChem, PC Fluorescence-based dose response cell-based high throughput screening assay to identify antagonists of the G-protein coupled receptor 7 (GPR7). PubChem Bioassay (2010)[AID] 
Target
Name:
Neuropeptides B/W receptor type 1
Synonyms:
GPR7 NPBWR1 | neuropeptides B/W receptor 1
Type:
Enzyme Catalytic Domain
Mol. Mass.:
36111.82
Organism:
Homo sapiens (Human)
Description:
gi_119607128
Residue:
328
  
Inhibitor
Name:
BDBM42429
Synonyms:
1-(4-methylphenyl)-2-(3-phenyl-6,7,8,9-tetrahydro-5H-imidazo[1,2-a]azepin-1-ium-1-yl)ethanone;bromide 2-(3-phenyl-6,7,8,9-tetrahydro-5H-imidaz[1,2-a]azepin-1-ium-1-yl)-1-(p-tolyl)ethanone;bromide SMR000193443 | cid_2873634
Type:
Small organic molecule
Emp. Form.:
C23H25N2O
Mol. Mass.:
345.4569
SMILES:
Cc1ccc(cc1)C(=O)C[n+]1cc(-c2ccccc2)n2CCCCCc12
: