Target
Neuropeptides B/W receptor type 1
Ligand
BDBM62142
Substrate
Meas. Tech.
Fluorescence-based dose response cell-based high throughput screening assay to identify antagonists of the G-protein coupled receptor 7 (GPR7).
IC50
10642±n/a nM
Citation
 PubChem, PC Fluorescence-based dose response cell-based high throughput screening assay to identify antagonists of the G-protein coupled receptor 7 (GPR7). PubChem Bioassay (2010)[AID] 
Target
Name:
Neuropeptides B/W receptor type 1
Synonyms:
GPR7 NPBWR1 | neuropeptides B/W receptor 1
Type:
Enzyme Catalytic Domain
Mol. Mass.:
36111.82
Organism:
Homo sapiens (Human)
Description:
gi_119607128
Residue:
328
  
Inhibitor
Name:
BDBM62142
Synonyms:
(4S)-1-benzyl-2-(2-methoxyethylamino)-6-methyl-4-[3-(trifluoromethyl)phenyl]-4H-pyrimidine-5-carboxylic acid methyl ester MLS000830374 cid_24789235 methyl (4S)-2-(2-methoxyethylamino)-6-methyl-1-(phenylmethyl)-4-[3-(trifluoromethyl)phenyl]-4H-pyrimidine-5-carboxylate
Type:
Small organic molecule
Emp. Form.:
C24H26F3N3O3
Mol. Mass.:
461.4767
SMILES:
COCCNC1=N[C@H](C(C(=O)OC)=C(C)N1Cc1ccccc1)c1cccc(c1)C(F)(F)F
: