Target
Kappa-type opioid receptor
Ligand
BDBM46582
Substrate
Meas. Tech.
SAR analysis of small molecule antagonists of the kappa opioid receptor via a luminescent beta-arrestin assay
IC50
10000±n/a nM
Citation
 PubChem, PC SAR analysis of small molecule antagonists of the kappa opioid receptor via a luminescent beta-arrestin assay PubChem Bioassay (2010)[AID] 
Target
Name:
Kappa-type opioid receptor
Synonyms:
K-OR-1 Kappa-opioid receptor (KOR) Kappa-type opioid receptor (KOR) OPIATE Kappa OPRK1 kappa opioid receptor (KOR)
Type:
G Protein-Coupled Receptor (GPCR)
Mol. Mass.:
42648.76
Organism:
Homo sapiens (Human)
Description:
P41145
Residue:
380
  
Inhibitor
Name:
BDBM46582
Synonyms:
(4Z)-4-[[(7-chloro-4-quinolinyl)hydrazo]methylidene]-2-hydroxy-1-cyclohexa-2,5-dienone (4Z)-4-[[2-(7-chloroquinolin-4-yl)hydrazinyl]methylidene]-2-hydroxycyclohexa-2,5-dien-1-one MLS000760794 cid_6524677
Type:
Small organic molecule
Emp. Form.:
C16H12ClN3O2
Mol. Mass.:
313.738
SMILES:
Oc1ccc(CN=Nc2ccnc3cc(Cl)ccc23)cc1O
: