Target
Kappa-type opioid receptor
Ligand
BDBM62204
Substrate
Meas. Tech.
SAR analysis of small molecule antagonists of the kappa opioid receptor via a luminescent beta-arrestin assay
IC50
10000±n/a nM
Citation
 PubChem, PC SAR analysis of small molecule antagonists of the kappa opioid receptor via a luminescent beta-arrestin assay PubChem Bioassay (2010)[AID] 
Target
Name:
Kappa-type opioid receptor
Synonyms:
K-OR-1 Kappa-opioid receptor (KOR) Kappa-type opioid receptor (KOR) OPIATE Kappa OPRK1 kappa opioid receptor (KOR)
Type:
G Protein-Coupled Receptor (GPCR)
Mol. Mass.:
42648.76
Organism:
Homo sapiens (Human)
Description:
P41145
Residue:
380
  
Inhibitor
Name:
BDBM62204
Synonyms:
MLS-0360688.0001 N-[3-[4-(4-fluorophenyl)piperazin-1-yl]propyl]-2-(4-oxidanylidenepyrrolo[1,2-a]quinoxalin-5-yl)ethanamide N-[3-[4-(4-fluorophenyl)piperazino]propyl]-2-(4-ketopyrrolo[1,2-a]quinoxalin-5-yl)acetamide | cid_22522555
Type:
Small organic molecule
Emp. Form.:
C26H28FN5O2
Mol. Mass.:
461.5312
SMILES:
Fc1ccc(cc1)N1CCN(CCCNC(=O)Cn2c3ccccc3n3cccc3c2=O)CC1
: