Target
Regulator of G-protein signaling 4
Ligand
BDBM47798
Substrate
Meas. Tech.
Dose response, multiplexed high-throughput screen for small molecule regulators of RGS family protein interactions, specifically RGS4-Galphao for SAR compounds
EC50
30000±n/a nM
Citation
 PubChem, PC Dose response, multiplexed high-throughput screen for small molecule regulators of RGS family protein interactions, specifically RGS4-Galphao for SAR compounds PubChem Bioassay (2010)[AID] 
Target
Name:
Regulator of G-protein signaling 4
Synonyms:
RGP4 RGS4_HUMAN | Regulator of G-protein signaling 4 (RGS4)
Type:
Enzyme
Mol. Mass.:
23263.51
Organism:
Homo sapiens (Human)
Description:
P49798
Residue:
205
  
Inhibitor
Name:
BDBM47798
Synonyms:
4-chloranyl-6-(4,6-dimethylpyrimidin-2-yl)sulfanyl-N-methyl-1,3,5-triazin-2-amine 4-chloro-6-[(4,6-dimethyl-2-pyrimidinyl)thio]-N-methyl-1,3,5-triazin-2-amine SMR000288800 cid_1087037
Type:
Small organic molecule
Emp. Form.:
C10H11ClN6S
Mol. Mass.:
282.753
SMILES:
CNc1nc(Cl)nc(Sc2nc(C)cc(C)n2)n1
: