Target
Regulator of G-protein signaling 4
Ligand
BDBM62217
Substrate
Meas. Tech.
Dose response, multiplexed high-throughput screen for small molecule regulators of RGS family protein interactions, specifically RGS4-Galphao for SAR compounds
EC50
30000±n/a nM
Citation
 PubChem, PC Dose response, multiplexed high-throughput screen for small molecule regulators of RGS family protein interactions, specifically RGS4-Galphao for SAR compounds PubChem Bioassay (2010)[AID] 
Target
Name:
Regulator of G-protein signaling 4
Synonyms:
RGP4 RGS4_HUMAN | Regulator of G-protein signaling 4 (RGS4)
Type:
Enzyme
Mol. Mass.:
23263.51
Organism:
Homo sapiens (Human)
Description:
P49798
Residue:
205
  
Inhibitor
Name:
BDBM62217
Synonyms:
2,4-dimethyl-6-[2-oxidanylidene-2-(4-phenylpiperazin-1-yl)ethyl]-1,6-naphthyridin-5-one 2,4-dimethyl-6-[2-oxo-2-(4-phenylpiperazin-1-yl)ethyl]-1,6-naphthyridin-5-one KUC103672N | cid_44473128
Type:
Small organic molecule
Emp. Form.:
C22H24N4O2
Mol. Mass.:
376.4516
SMILES:
Cc1cc(C)c2c(ccn(CC(=O)N3CCN(CC3)c3ccccc3)c2=O)n1
: