Target
Regulator of G-protein signaling 7
Ligand
BDBM47732
Substrate
Meas. Tech.
Dose response, multiplexed high-throughput screen for small molecule regulators of RGS family protein interactions, specifically RGS7-Galphao for SAR Compounds
EC50
3565±n/a nM
Citation
 PubChem, PC Dose response, multiplexed high-throughput screen for small molecule regulators of RGS family protein interactions, specifically RGS7-Galphao for SAR Compounds PubChem Bioassay (2010)[AID] 
Target
Name:
Regulator of G-protein signaling 7
Synonyms:
RGS7 | RGS7_HUMAN
Type:
Enzyme Catalytic Domain
Mol. Mass.:
57675.72
Organism:
Homo sapiens (Human)
Description:
P49802
Residue:
495
  
Inhibitor
Name:
BDBM47732
Synonyms:
2,6,7-trihydroxy-9-o-phenetyl-fluorone 9-(2-ethoxyphenyl)-2,6,7-trihydroxy-3H-xanthen-3-one 9-(2-ethoxyphenyl)-2,6,7-tris(oxidanyl)xanthen-3-one SMR000197680 | cid_2931388
Type:
Small organic molecule
Emp. Form.:
C21H16O6
Mol. Mass.:
364.3481
SMILES:
CCOc1ccccc1-c1c2cc(O)c(O)cc2oc2cc(=O)c(O)cc12
: