Target
Regulator of G-protein signaling 7
Ligand
BDBM46590
Substrate
Meas. Tech.
Dose response, multiplexed high-throughput screen for small molecule regulators of RGS family protein interactions, specifically RGS7-Galphao for SAR Compounds
EC50
141±n/a nM
Citation
 PubChem, PC Dose response, multiplexed high-throughput screen for small molecule regulators of RGS family protein interactions, specifically RGS7-Galphao for SAR Compounds PubChem Bioassay (2010)[AID] 
Target
Name:
Regulator of G-protein signaling 7
Synonyms:
RGS7 | RGS7_HUMAN
Type:
Enzyme Catalytic Domain
Mol. Mass.:
57675.72
Organism:
Homo sapiens (Human)
Description:
P49802
Residue:
495
  
Inhibitor
Name:
BDBM46590
Synonyms:
4-[2-[(E)-(2,3-dihydroxy-4-oxocyclohexa-2,5-dien-1-ylidene)methyl]hydrazinyl]-3-nitrobenzenesulfonamide 4-[N'-[(E)-(2,3-dihydroxy-4-keto-cyclohexa-2,5-dien-1-ylidene)methyl]hydrazino]-3-nitro-benzenesulfonamide MLS000759826 cid_5982653
Type:
Small organic molecule
Emp. Form.:
C13H12N4O7S
Mol. Mass.:
368.322
SMILES:
NS(=O)(=O)c1ccc(N=[NH+]Cc2ccc([O-])c(O)c2O)c(c1)[N+]([O-])=O
: