Target
Regulator of G-protein signaling 16
Ligand
BDBM47719
Substrate
Meas. Tech.
Dose response, multiplexed high-throughput screen for small molecule regulators of RGS family protein interactions, specifically RGS16-Galphao for SAR Compounds
Ki
40±n/a nM
Citation
 PubChem, PC Dose response, multiplexed high-throughput screen for small molecule regulators of RGS family protein interactions, specifically RGS16-Galphao for SAR Compounds PubChem Bioassay (2010)[AID] 
Target
Name:
Regulator of G-protein signaling 16
Synonyms:
RGS16 RGSR regulator of G-protein signalling 16
Type:
Enzyme Catalytic Domain
Mol. Mass.:
22748.87
Organism:
Homo sapiens (Human)
Description:
gi_156416009
Residue:
202
  
Inhibitor
Name:
BDBM47719
Synonyms:
(4-chlorodithiazol-5-ylidene)-(4-chloro-2-methyl-phenyl)amine 4-chloro-N-(4-chloro-2-methylphenyl)-5-dithiazolimine 4-chloro-N-(4-chloro-5H-1,2,3-dithiazol-5-yliden)-2-methylaniline SMR000125448 | cid_1471255
Type:
Small organic molecule
Emp. Form.:
C9H6Cl2N2S2
Mol. Mass.:
277.193
SMILES:
Cc1cc(Cl)ccc1\N=c1\ssnc1Cl
: