Target
Sphingosine 1-phosphate receptor 4
Ligand
BDBM62222
Substrate
Meas. Tech.
Late stage fluorescence dose response cell-based screening assay for antagonists of the Sphingosine 1-Phosphate Receptor 4 (S1P4)
IC50
886.7±n/a nM
Citation
 PubChem, PC Late stage fluorescence dose response cell-based screening assay for antagonists of the Sphingosine 1-Phosphate Receptor 4 (S1P4) PubChem Bioassay (2010)[AID] 
Target
Name:
Sphingosine 1-phosphate receptor 4
Synonyms:
EDG6 S1P receptor 4 S1P4 S1PR4_HUMAN Sphingosine 1-phosphate receptor Edg-6 sphingosine-1-phosphate 4 S1P4
Type:
G Protein-Coupled Receptor (GPCR)
Mol. Mass.:
41647.39
Organism:
Homo sapiens (Human)
Description:
Residue:
384
  
Inhibitor
Name:
BDBM62222
Synonyms:
2-(4-bromobenzylidene)malonic acid diethyl ester SR-01000076616 cid_367432 | diethyl 2-[(4-bromophenyl)methylidene]propanedioate
Type:
Small organic molecule
Emp. Form.:
C14H15BrO4
Mol. Mass.:
327.171
SMILES:
[#6]-[#6]-[#8]-[#6](=O)-[#6](=[#6]/c1ccc(Br)cc1)\[#6](=O)-[#8]-[#6]-[#6]
: