Target
Sphingosine 1-phosphate receptor 4
Ligand
BDBM37141
Substrate
Meas. Tech.
Late stage fluorescence dose response cell-based screening assay for antagonists of the Sphingosine 1-Phosphate Receptor 4 (S1P4)
IC50
4510±n/a nM
Citation
 PubChem, PC Late stage fluorescence dose response cell-based screening assay for antagonists of the Sphingosine 1-Phosphate Receptor 4 (S1P4) PubChem Bioassay (2010)[AID] 
Target
Name:
Sphingosine 1-phosphate receptor 4
Synonyms:
EDG6 S1P receptor 4 S1P4 S1PR4_HUMAN Sphingosine 1-phosphate receptor Edg-6 sphingosine-1-phosphate 4 S1P4
Type:
G Protein-Coupled Receptor (GPCR)
Mol. Mass.:
41647.39
Organism:
Homo sapiens (Human)
Description:
Residue:
384
  
Inhibitor
Name:
BDBM37141
Synonyms:
1-(3-methoxyphenyl)-5-(propylsulfonyl)-1H-tetrazole 1-(3-methoxyphenyl)-5-propylsulfonyl-tetrazole MLS000050377 cid_2215161
Type:
Small organic molecule
Emp. Form.:
C11H14N4O3S
Mol. Mass.:
282.319
SMILES:
CCCS(=O)(=O)c1nnnn1-c1cccc(OC)c1
: