Target
Nucleotide-binding oligomerization domain-containing protein 1
Ligand
BDBM50100134
Substrate
Meas. Tech.
SAR analysis of compounds that inhibit NOD1 revised
IC50
556±n/a nM
Citation
 PubChem, PC SAR analysis of compounds that inhibit NOD1 revised PubChem Bioassay (2010)[AID] 
Target
Name:
Nucleotide-binding oligomerization domain-containing protein 1
Synonyms:
CARD4 NOD1_HUMAN | nucleotide-binding oligomerization domain containing 1
Type:
Enzyme Catalytic Domain
Mol. Mass.:
107699.03
Organism:
Homo sapiens (Human)
Description:
gi_5174617
Residue:
953
  
Inhibitor
Name:
BDBM50100134
Synonyms:
2-(4-Dimethylamino-phenyl)-3,6-dimethyl-benzothiazol-3-ium 2-[4-(dimethylamino)phenyl]-3,6-dimethyl-1,3-benzothiazol-3-ium CHEMBL57267 Thioflavin T, 1 cid_16954
Type:
Small organic molecule
Emp. Form.:
C17H19N2S
Mol. Mass.:
283.411
SMILES:
CN(C)c1ccc(cc1)-c1sc2cc(C)ccc2[n+]1C
: