Target
Nucleotide-binding oligomerization domain-containing protein 1
Ligand
BDBM62307
Substrate
Meas. Tech.
SAR analysis of compounds that inhibit NOD1 revised
IC50
20000±n/a nM
Citation
 PubChem, PC SAR analysis of compounds that inhibit NOD1 revised PubChem Bioassay (2010)[AID] 
Target
Name:
Nucleotide-binding oligomerization domain-containing protein 1
Synonyms:
CARD4 NOD1_HUMAN | nucleotide-binding oligomerization domain containing 1
Type:
Enzyme Catalytic Domain
Mol. Mass.:
107699.03
Organism:
Homo sapiens (Human)
Description:
gi_5174617
Residue:
953
  
Inhibitor
Name:
BDBM62307
Synonyms:
(5,6-dimethyl-1-tosyl-benzimidazol-2-yl)amine 5,6-dimethyl-1-(4-methylphenyl)sulfonyl-benzimidazol-2-amine MLS-0425618.0001 | cid_44229067
Type:
Small organic molecule
Emp. Form.:
C16H17N3O2S
Mol. Mass.:
315.39
SMILES:
Cc1ccc(cc1)S(=O)(=O)n1c(N)nc2cc(C)c(C)cc12
: