Target
Nucleotide-binding oligomerization domain-containing protein 2
Ligand
BDBM62331
Substrate
Meas. Tech.
SAR analysis of compounds that inhibit NOD2 revised
IC50
20000±n/a nM
Citation
 PubChem, PC SAR analysis of compounds that inhibit NOD2 revised PubChem Bioassay (2010)[AID] 
Target
Name:
Nucleotide-binding oligomerization domain-containing protein 2
Synonyms:
CARD15 IBD1 NOD2 Nucleotide-binding oligomerization domain-containing protein 2 | nucleotide-binding oligomerization domain containing 2
Type:
PROTEIN
Mol. Mass.:
115287.18
Organism:
Homo sapiens (Human)
Description:
ChEMBL_1454053
Residue:
1040
  
Inhibitor
Name:
BDBM62331
Synonyms:
4-chloranyl-N-[4-(3,4-dihydro-1H-isoquinolin-2-ylmethyl)phenyl]benzamide MLS-0425630.0001 | cid_44251475
Type:
Small organic molecule
Emp. Form.:
C23H21ClN2O
Mol. Mass.:
376.879
SMILES:
Clc1ccc(cc1)C(=O)Nc1ccc(CN2CCc3ccccc3C2)cc1
: