Target
Nucleotide-binding oligomerization domain-containing protein 2
Ligand
BDBM54177
Substrate
Meas. Tech.
SAR analysis of compounds that inhibit NOD2 revised
IC50
20000±n/a nM
Citation
 PubChem, PC SAR analysis of compounds that inhibit NOD2 revised PubChem Bioassay (2010)[AID] 
Target
Name:
Nucleotide-binding oligomerization domain-containing protein 2
Synonyms:
CARD15 IBD1 NOD2 Nucleotide-binding oligomerization domain-containing protein 2 | nucleotide-binding oligomerization domain containing 2
Type:
PROTEIN
Mol. Mass.:
115287.18
Organism:
Homo sapiens (Human)
Description:
ChEMBL_1454053
Residue:
1040
  
Inhibitor
Name:
BDBM54177
Synonyms:
MLS000107619 N-[1-[(4-chlorophenyl)methyl]-2-benzimidazolyl]-2-furancarboxamide SMR000103585 | cid_1034468
Type:
Small organic molecule
Emp. Form.:
C19H14ClN3O2
Mol. Mass.:
351.786
SMILES:
Clc1ccc(Cn2c(NC(=O)c3ccco3)nc3ccccc23)cc1
: