Target
Nucleotide-binding oligomerization domain-containing protein 2
Ligand
BDBM59512
Substrate
Meas. Tech.
SAR analysis of compounds that inhibit NOD2 revised
IC50
3990±n/a nM
Citation
 PubChem, PC SAR analysis of compounds that inhibit NOD2 revised PubChem Bioassay (2010)[AID] 
Target
Name:
Nucleotide-binding oligomerization domain-containing protein 2
Synonyms:
CARD15 IBD1 NOD2 Nucleotide-binding oligomerization domain-containing protein 2 | nucleotide-binding oligomerization domain containing 2
Type:
PROTEIN
Mol. Mass.:
115287.18
Organism:
Homo sapiens (Human)
Description:
ChEMBL_1454053
Residue:
1040
  
Inhibitor
Name:
BDBM59512
Synonyms:
2-[5,7-bis(trifluoromethyl)-1,8-naphthyridin-2-yl]-2-phenyl-acetonitrile 2-[5,7-bis(trifluoromethyl)-1,8-naphthyridin-2-yl]-2-phenylacetonitrile MLS000539973 cid_3567991
Type:
Small organic molecule
Emp. Form.:
C18H9F6N3
Mol. Mass.:
381.2746
SMILES:
FC(F)(F)c1cc(c2ccc(nc2n1)C(C#N)c1ccccc1)C(F)(F)F
: