Target
Nucleotide-binding oligomerization domain-containing protein 2
Ligand
BDBM62369
Substrate
Meas. Tech.
SAR analysis of compounds that inhibit NOD2 revised
IC50
20000±n/a nM
Citation
 PubChem, PC SAR analysis of compounds that inhibit NOD2 revised PubChem Bioassay (2010)[AID] 
Target
Name:
Nucleotide-binding oligomerization domain-containing protein 2
Synonyms:
CARD15 IBD1 NOD2 Nucleotide-binding oligomerization domain-containing protein 2 | nucleotide-binding oligomerization domain containing 2
Type:
PROTEIN
Mol. Mass.:
115287.18
Organism:
Homo sapiens (Human)
Description:
ChEMBL_1454053
Residue:
1040
  
Inhibitor
Name:
BDBM62369
Synonyms:
MLS-0435444.0001 N-[1-[(4-chlorophenyl)methyl]-2-benzimidazolyl]cyclohexanecarboxamide cid_1316668
Type:
Small organic molecule
Emp. Form.:
C21H22ClN3O
Mol. Mass.:
367.872
SMILES:
Clc1ccc(Cn2c(NC(=O)C3CCCCC3)nc3ccccc23)cc1
: