Target
G-protein coupled receptor 35
Ligand
BDBM61054
Substrate
Meas. Tech.
SAR analysis of Antagonists of the GPR35 Receptor using an Image-Based Assay
IC50
32000±n/a nM
Citation
 PubChem, PC SAR analysis of Antagonists of the GPR35 Receptor using an Image-Based Assay PubChem Bioassay (2010)[AID] 
Target
Name:
G-protein coupled receptor 35
Synonyms:
G protein-coupled receptor 35 GPR35_HUMAN
Type:
Enzyme Catalytic Domain
Mol. Mass.:
34085.57
Organism:
Homo sapiens (Human)
Description:
gi_33695097
Residue:
309
  
Inhibitor
Name:
BDBM61054
Synonyms:
MLS000579482 N-(2-methoxydibenzo[b,d]furan-3-yl)-2-(phenylthio)acetamide N-(2-methoxydibenzofuran-3-yl)-2-phenylsulfanyl-ethanamide SMR000198916 | cid_2944641
Type:
Small organic molecule
Emp. Form.:
C21H17NO3S
Mol. Mass.:
363.43
SMILES:
COc1cc2c(cc1NC(=O)CSc1ccccc1)oc1ccccc21
: