Target
Kappa-type opioid receptor
Ligand
BDBM62173
Substrate
Meas. Tech.
SAR analysis of Antagonists of the Kappa Opioid Receptor (KOR) using an Image-Based Assay
IC50
32000±n/a nM
Citation
 PubChem, PC SAR analysis of Antagonists of the Kappa Opioid Receptor (KOR) using an Image-Based Assay PubChem Bioassay (2010)[AID] 
Target
Name:
Kappa-type opioid receptor
Synonyms:
K-OR-1 Kappa-opioid receptor (KOR) Kappa-type opioid receptor (KOR) OPIATE Kappa OPRK1 kappa opioid receptor (KOR)
Type:
G Protein-Coupled Receptor (GPCR)
Mol. Mass.:
42648.76
Organism:
Homo sapiens (Human)
Description:
P41145
Residue:
380
  
Inhibitor
Name:
BDBM62173
Synonyms:
2-(3-keto-1,4-benzoxazin-4-yl)-N-p-anisyl-N-(2-pyridylmethyl)acetamide N-[(4-methoxyphenyl)methyl]-2-(3-oxidanylidene-1,4-benzoxazin-4-yl)-N-(pyridin-2-ylmethyl)ethanamide N-[(4-methoxyphenyl)methyl]-2-(3-oxo-1,4-benzoxazin-4-yl)-N-(pyridin-2-ylmethyl)acetamide | cid_653720
Type:
Small organic molecule
Emp. Form.:
C24H23N3O4
Mol. Mass.:
417.4571
SMILES:
COc1ccc(CN(Cc2ccccn2)C(=O)CN2C(=O)COc3ccccc23)cc1
: