Target
Mu-type opioid receptor
Ligand
BDBM57352
Substrate
Meas. Tech.
SAR Analysis of Agonists of the MOR Receptor using an Image-Based Assay
EC50
>32000±n/a nM
Citation
 PubChem, PC SAR Analysis of Agonists of the MOR Receptor using an Image-Based Assay PubChem Bioassay (2010)[AID] 
Target
Name:
Mu-type opioid receptor
Synonyms:
M-OR-1 MOR-1 MUOR1 Mu opiate receptor OPRM1 hMOP | mu-type opioid receptor isoform MOR-1
Type:
G Protein-Coupled Receptor (GPCR)
Mol. Mass.:
44789.51
Organism:
Homo sapiens (Human)
Description:
P35372
Residue:
400
  
Inhibitor
Name:
BDBM57352
Synonyms:
(phenylmethyl) N-[2,2,2-tris(chloranyl)-1-[(3-chlorophenyl)carbamothioylamino]ethyl]carbamate N-[2,2,2-trichloro-1-[(3-chlorophenyl)thiocarbamoylamino]ethyl]carbamic acid benzyl ester SMR000173874 cid_3091264 | {2,2,2-Trichloro-1-[3-(3-chloro-phenyl)-thioureido]-ethyl}-carbamic acid benzyl ester
Type:
Small organic molecule
Emp. Form.:
C17H15Cl4N3O2S
Mol. Mass.:
467.197
SMILES:
Clc1cccc(NC(=S)NC(NC(=O)OCc2ccccc2)C(Cl)(Cl)Cl)c1
: