Target
Mu-type opioid receptor
Ligand
BDBM54805
Substrate
Meas. Tech.
SAR Analysis of Agonists of the MOR Receptor using an Image-Based Assay
EC50
>32000±n/a nM
Citation
 PubChem, PC SAR Analysis of Agonists of the MOR Receptor using an Image-Based Assay PubChem Bioassay (2010)[AID] 
Target
Name:
Mu-type opioid receptor
Synonyms:
M-OR-1 MOR-1 MUOR1 Mu opiate receptor OPRM1 hMOP | mu-type opioid receptor isoform MOR-1
Type:
G Protein-Coupled Receptor (GPCR)
Mol. Mass.:
44789.51
Organism:
Homo sapiens (Human)
Description:
P35372
Residue:
400
  
Inhibitor
Name:
BDBM54805
Synonyms:
(phenylmethyl) N-[1-[[2,6-bis(chloranyl)phenyl]carbamothioylamino]-2,2,2-tris(chloranyl)ethyl]carbamate N-[2,2,2-trichloro-1-[(2,6-dichlorophenyl)thiocarbamoylamino]ethyl]carbamic acid benzyl ester SMR000173875 cid_3091265 | {2,2,2-Trichloro-1-[3-(2,6-dichloro-phenyl)-thioureido]-ethyl}-carbamic acid benzyl ester
Type:
Small organic molecule
Emp. Form.:
C17H14Cl5N3O2S
Mol. Mass.:
501.642
SMILES:
Clc1cccc(Cl)c1NC(=S)NC(NC(=O)OCc1ccccc1)C(Cl)(Cl)Cl
: