Target
Sphingosine 1-phosphate receptor 2
Ligand
BDBM57614
Substrate
Meas. Tech.
Late stage counterscreen assay for S1P4 antagonists: Fluorescence dose response cell-based screening assay for antagonists of the Sphingosine 1-Phosphate Receptor 2 (S1P2)
IC50
2349±n/a nM
Citation
 PubChem, PC Late stage counterscreen assay for S1P4 antagonists: Fluorescence dose response cell-based screening assay for antagonists of the Sphingosine 1-Phosphate Receptor 2 (S1P2) PubChem Bioassay (2010)[AID] 
Target
Name:
Sphingosine 1-phosphate receptor 2
Synonyms:
EDG5 S1PR2 Sphingosine 1-phosphate receptor Sphingosine-1-phosphate receptor 2 | ndothelial differentiation G-protein coupled receptor 5
Type:
G Protein-Coupled Receptor (GPCR)
Mol. Mass.:
38883.16
Organism:
Homo sapiens (Human)
Description:
Membranes isolated from S1P2-transfected CHO cells were used in ligand binding assay.
Residue:
353
  
Inhibitor
Name:
BDBM57614
Synonyms:
1-[3,5-bis(2,2,2-trifluoroethoxy)phenyl]-3-phenyl-urea 1-[3,5-bis[2,2,2-tris(fluoranyl)ethoxy]phenyl]-3-phenyl-urea SMR000260731 | cid_2328694
Type:
Small organic molecule
Emp. Form.:
C17H14F6N2O3
Mol. Mass.:
408.2951
SMILES:
FC(F)(F)COc1cc(NC(=O)Nc2ccccc2)cc(OCC(F)(F)F)c1
: