Target
Sphingosine 1-phosphate receptor 2
Ligand
BDBM62406
Substrate
Meas. Tech.
Late stage counterscreen assay for S1P4 antagonists: Fluorescence dose response cell-based screening assay for antagonists of the Sphingosine 1-Phosphate Receptor 2 (S1P2)
IC50
9496±n/a nM
Citation
 PubChem, PC Late stage counterscreen assay for S1P4 antagonists: Fluorescence dose response cell-based screening assay for antagonists of the Sphingosine 1-Phosphate Receptor 2 (S1P2) PubChem Bioassay (2010)[AID] 
Target
Name:
Sphingosine 1-phosphate receptor 2
Synonyms:
EDG5 S1PR2 Sphingosine 1-phosphate receptor Sphingosine-1-phosphate receptor 2 | ndothelial differentiation G-protein coupled receptor 5
Type:
G Protein-Coupled Receptor (GPCR)
Mol. Mass.:
38883.16
Organism:
Homo sapiens (Human)
Description:
Membranes isolated from S1P2-transfected CHO cells were used in ligand binding assay.
Residue:
353
  
Inhibitor
Name:
BDBM62406
Synonyms:
5-[2,5-bis(chloranyl)phenyl]-N-(2-chloranyl-6-methyl-phenyl)furan-2-carboxamide N-(2-chloro-6-methylphenyl)-5-(2,5-dichlorophenyl)-2-furancarboxamide SR-02000000250 cid_44607579
Type:
Small organic molecule
Emp. Form.:
C18H12Cl3NO2
Mol. Mass.:
380.652
SMILES:
Cc1cccc(Cl)c1NC(=O)c1ccc(o1)-c1cc(Cl)ccc1Cl
: