Target
Delta-type opioid receptor
Ligand
BDBM54773
Substrate
Meas. Tech.
SAR Analysis of Antagonists of the DOR Receptor using an Image-Based Assay
IC50
32000±n/a nM
Citation
 PubChem, PC SAR Analysis of Antagonists of the DOR Receptor using an Image-Based Assay PubChem Bioassay (2010)[AID] 
Target
Name:
Delta-type opioid receptor
Synonyms:
D-OR-1 Delta opioid receptor OPIATE Delta OPRD1 OPRK1 | opioid receptor, delta 1
Type:
G Protein-Coupled Receptor (GPCR)
Mol. Mass.:
40382.98
Organism:
Homo sapiens (Human)
Description:
Competition binding assays were carried out using membrane preparations from transfected HN9.10 cells that constitutively expressed the delta opioid receptor.
Residue:
372
  
Inhibitor
Name:
BDBM54773
Synonyms:
2-[5-[(3-chlorobenzyl)thio]-4-(2-furfuryl)-1,2,4-triazol-3-yl]pyridine 2-[5-[(3-chlorophenyl)methylthio]-4-(2-furanylmethyl)-1,2,4-triazol-3-yl]pyridine SMR000042990 | cid_662263
Type:
Small organic molecule
Emp. Form.:
C19H15ClN4OS
Mol. Mass.:
382.867
SMILES:
Clc1cccc(CSc2nnc(-c3ccccn3)n2Cc2ccco2)c1
: