Target
Delta-type opioid receptor
Ligand
BDBM62184
Substrate
Meas. Tech.
SAR Analysis of Antagonists of the DOR Receptor using an Image-Based Assay
IC50
32000±n/a nM
Citation
 PubChem, PC SAR Analysis of Antagonists of the DOR Receptor using an Image-Based Assay PubChem Bioassay (2010)[AID] 
Target
Name:
Delta-type opioid receptor
Synonyms:
D-OR-1 Delta opioid receptor OPIATE Delta OPRD1 OPRK1 | opioid receptor, delta 1
Type:
G Protein-Coupled Receptor (GPCR)
Mol. Mass.:
40382.98
Organism:
Homo sapiens (Human)
Description:
Competition binding assays were carried out using membrane preparations from transfected HN9.10 cells that constitutively expressed the delta opioid receptor.
Residue:
372
  
Inhibitor
Name:
BDBM62184
Synonyms:
MLS-0425692.0001 [1-[[1-(3-methylphenyl)imidazol-2-yl]methyl]-4-(oxan-2-ylmethyl)piperidin-4-yl]methanol cid_44537711
Type:
Small organic molecule
Emp. Form.:
C23H33N3O2
Mol. Mass.:
383.527
SMILES:
Cc1cccc(c1)-n1ccnc1CN1CCC(CO)(CC2CCCCO2)CC1
: