Target
Kappa-type opioid receptor
Ligand
BDBM40197
Substrate
Meas. Tech.
SAR analysis of Agonists of the Kappa Opioid Receptor (KOR) using an Image-Based Assay
EC50
>32000±n/a nM
Citation
 PubChem, PC SAR analysis of Agonists of the Kappa Opioid Receptor (KOR) using an Image-Based Assay PubChem Bioassay (2010)[AID] 
Target
Name:
Kappa-type opioid receptor
Synonyms:
K-OR-1 Kappa-opioid receptor (KOR) Kappa-type opioid receptor (KOR) OPIATE Kappa OPRK1 kappa opioid receptor (KOR)
Type:
G Protein-Coupled Receptor (GPCR)
Mol. Mass.:
42648.76
Organism:
Homo sapiens (Human)
Description:
P41145
Residue:
380
  
Inhibitor
Name:
BDBM40197
Synonyms:
(2Z)-2-[(8-quinolinylamino)methylidene]-1-benzothiophen-3-one (2Z)-2-[(quinolin-8-ylamino)methylidene]-1-benzothiophen-3-one MLS000530291 cid_5407397
Type:
Small organic molecule
Emp. Form.:
C18H12N2OS
Mol. Mass.:
304.366
SMILES:
Oc1c(C=Nc2cccc3cccnc23)sc2ccccc12
: