Target
Kappa-type opioid receptor
Ligand
BDBM62200
Substrate
Meas. Tech.
SAR analysis of Agonists of the Kappa Opioid Receptor (KOR) using an Image-Based Assay
EC50
>32000±n/a nM
Citation
 PubChem, PC SAR analysis of Agonists of the Kappa Opioid Receptor (KOR) using an Image-Based Assay PubChem Bioassay (2010)[AID] 
Target
Name:
Kappa-type opioid receptor
Synonyms:
K-OR-1 Kappa-opioid receptor (KOR) Kappa-type opioid receptor (KOR) OPIATE Kappa OPRK1 kappa opioid receptor (KOR)
Type:
G Protein-Coupled Receptor (GPCR)
Mol. Mass.:
42648.76
Organism:
Homo sapiens (Human)
Description:
P41145
Residue:
380
  
Inhibitor
Name:
BDBM62200
Synonyms:
4-[[(4-methoxyphenyl)sulfonylamino]methyl]-N-[2-[methyl-(phenylmethyl)amino]ethyl]benzamide N-[2-[benzyl(methyl)amino]ethyl]-4-[[(4-methoxyphenyl)sulfonylamino]methyl]benzamide | cid_20854195
Type:
Small organic molecule
Emp. Form.:
C25H29N3O4S
Mol. Mass.:
467.58
SMILES:
COc1ccc(cc1)S(=O)(=O)NCc1ccc(cc1)C(=O)NCCN(C)Cc1ccccc1
: