Target
Kappa-type opioid receptor
Ligand
BDBM62186
Substrate
Meas. Tech.
SAR analysis of Agonists of the Kappa Opioid Receptor (KOR) using an Image-Based Assay
EC50
98.3±n/a nM
Citation
 PubChem, PC SAR analysis of Agonists of the Kappa Opioid Receptor (KOR) using an Image-Based Assay PubChem Bioassay (2010)[AID] 
Target
Name:
Kappa-type opioid receptor
Synonyms:
K-OR-1 Kappa-opioid receptor (KOR) Kappa-type opioid receptor (KOR) OPIATE Kappa OPRK1 kappa opioid receptor (KOR)
Type:
G Protein-Coupled Receptor (GPCR)
Mol. Mass.:
42648.76
Organism:
Homo sapiens (Human)
Description:
P41145
Residue:
380
  
Inhibitor
Name:
BDBM62186
Synonyms:
MLS-0425703.0001 N-[1-[(4-bromophenyl)carbamoyl]cyclohexyl]-N-(2-furfuryl)picolinamide cid_1282817
Type:
Small organic molecule
Emp. Form.:
C24H24BrN3O3
Mol. Mass.:
482.37
SMILES:
Brc1ccc(NC(=O)C2(CCCCC2)N(Cc2ccco2)C(=O)c2ccccn2)cc1
: