Target
Delta-type opioid receptor
Ligand
BDBM54836
Substrate
Meas. Tech.
SAR Analysis of Agonists of the DOR Receptor using an Image-Based Assay
EC50
30700±n/a nM
Citation
 PubChem, PC SAR Analysis of Agonists of the DOR Receptor using an Image-Based Assay PubChem Bioassay (2010)[AID] 
Target
Name:
Delta-type opioid receptor
Synonyms:
D-OR-1 Delta opioid receptor OPIATE Delta OPRD1 OPRK1 | opioid receptor, delta 1
Type:
G Protein-Coupled Receptor (GPCR)
Mol. Mass.:
40382.98
Organism:
Homo sapiens (Human)
Description:
Competition binding assays were carried out using membrane preparations from transfected HN9.10 cells that constitutively expressed the delta opioid receptor.
Residue:
372
  
Inhibitor
Name:
BDBM54836
Synonyms:
4-[1-[(7-chloro-4-quinolinyl)hydrazo]propylidene]-1-cyclohexa-2,5-dienone 4-[1-[2-(7-chloroquinolin-4-yl)hydrazinyl]propylidene]cyclohexa-2,5-dien-1-one MLS001173902 cid_6036600
Type:
Small organic molecule
Emp. Form.:
C18H16ClN3O
Mol. Mass.:
325.792
SMILES:
CCC(N=Nc1ccnc2cc(Cl)ccc12)c1ccc(O)cc1
: