Target
Delta-type opioid receptor
Ligand
BDBM62200
Substrate
Meas. Tech.
SAR Analysis of Agonists of the DOR Receptor using an Image-Based Assay
EC50
>32000±n/a nM
Citation
 PubChem, PC SAR Analysis of Agonists of the DOR Receptor using an Image-Based Assay PubChem Bioassay (2010)[AID] 
Target
Name:
Delta-type opioid receptor
Synonyms:
D-OR-1 Delta opioid receptor OPIATE Delta OPRD1 OPRK1 | opioid receptor, delta 1
Type:
G Protein-Coupled Receptor (GPCR)
Mol. Mass.:
40382.98
Organism:
Homo sapiens (Human)
Description:
Competition binding assays were carried out using membrane preparations from transfected HN9.10 cells that constitutively expressed the delta opioid receptor.
Residue:
372
  
Inhibitor
Name:
BDBM62200
Synonyms:
4-[[(4-methoxyphenyl)sulfonylamino]methyl]-N-[2-[methyl-(phenylmethyl)amino]ethyl]benzamide N-[2-[benzyl(methyl)amino]ethyl]-4-[[(4-methoxyphenyl)sulfonylamino]methyl]benzamide | cid_20854195
Type:
Small organic molecule
Emp. Form.:
C25H29N3O4S
Mol. Mass.:
467.58
SMILES:
COc1ccc(cc1)S(=O)(=O)NCc1ccc(cc1)C(=O)NCCN(C)Cc1ccccc1
: