Target
Delta-type opioid receptor
Ligand
BDBM62202
Substrate
Meas. Tech.
SAR Analysis of Agonists of the DOR Receptor using an Image-Based Assay
EC50
>32000±n/a nM
Citation
 PubChem, PC SAR Analysis of Agonists of the DOR Receptor using an Image-Based Assay PubChem Bioassay (2010)[AID] 
Target
Name:
Delta-type opioid receptor
Synonyms:
D-OR-1 Delta opioid receptor OPIATE Delta OPRD1 OPRK1 | opioid receptor, delta 1
Type:
G Protein-Coupled Receptor (GPCR)
Mol. Mass.:
40382.98
Organism:
Homo sapiens (Human)
Description:
Competition binding assays were carried out using membrane preparations from transfected HN9.10 cells that constitutively expressed the delta opioid receptor.
Residue:
372
  
Inhibitor
Name:
BDBM62202
Synonyms:
4-[[(4-acetamidophenyl)sulfonylamino]methyl]-N-[2-[benzyl(methyl)amino]ethyl]benzamide MLS-0425702.0001 | cid_20854254
Type:
Small organic molecule
Emp. Form.:
C26H30N4O4S
Mol. Mass.:
494.606
SMILES:
CN(CCNC(=O)c1ccc(CNS(=O)(=O)c2ccc(NC(C)=O)cc2)cc1)Cc1ccccc1
: