Target
Delta-type opioid receptor
Ligand
BDBM62207
Substrate
Meas. Tech.
SAR Analysis of Agonists of the DOR Receptor using an Image-Based Assay
EC50
>32000±n/a nM
Citation
 PubChem, PC SAR Analysis of Agonists of the DOR Receptor using an Image-Based Assay PubChem Bioassay (2010)[AID] 
Target
Name:
Delta-type opioid receptor
Synonyms:
D-OR-1 Delta opioid receptor OPIATE Delta OPRD1 OPRK1 | opioid receptor, delta 1
Type:
G Protein-Coupled Receptor (GPCR)
Mol. Mass.:
40382.98
Organism:
Homo sapiens (Human)
Description:
Competition binding assays were carried out using membrane preparations from transfected HN9.10 cells that constitutively expressed the delta opioid receptor.
Residue:
372
  
Inhibitor
Name:
BDBM62207
Synonyms:
MLS-0362777.0001 | cid_24791925
Type:
Small organic molecule
Emp. Form.:
C28H34N6O2
Mol. Mass.:
486.6086
SMILES:
Cc1ccc(C)c(c1)N1CCN(CCCNC(=O)CCn2c3ncccc3n3cccc3c2=O)CC1
: