Target
Trans-activator protein BZLF1
Ligand
BDBM62413
Substrate
Meas. Tech.
Counterscreen for inhibitors of EBNA-1: fluorescence polarization-based biochemical high throughput dose response assay to identify inhibitors of the Epstein-Barr virus-encoded protein, ZTA
IC50
111248±n/a nM
Citation
 PubChem, PC Counterscreen for inhibitors of EBNA-1: fluorescence polarization-based biochemical high throughput dose response assay to identify inhibitors of the Epstein-Barr virus-encoded protein, ZTA PubChem Bioassay (2010)[AID] 
Target
Name:
Trans-activator protein BZLF1
Synonyms:
BZLF1 PPP5C protein
Type:
Enzyme Catalytic Domain
Mol. Mass.:
26856.37
Organism:
Human herpesvirus 4
Description:
gi_82503229
Residue:
245
  
Inhibitor
Name:
BDBM62413
Synonyms:
5-amino-4-(1,3-benzothiazol-2-yl)-1-(4-methoxyphenyl)-2-pyrrolin-3-one 5-azanyl-4-(1,3-benzothiazol-2-yl)-1-(4-methoxyphenyl)-2H-pyrrol-3-one SMR000060394 | cid_725152
Type:
Small organic molecule
Emp. Form.:
C18H15N3O2S
Mol. Mass.:
337.396
SMILES:
COc1ccc(cc1)-n1cc(O)c(c1N)-c1nc2ccccc2s1
: