Target
Trans-activator protein BZLF1
Ligand
BDBM62455
Substrate
Meas. Tech.
Counterscreen for inhibitors of EBNA-1: fluorescence polarization-based biochemical high throughput dose response assay to identify inhibitors of the Epstein-Barr virus-encoded protein, ZTA
IC50
111248±n/a nM
Citation
 PubChem, PC Counterscreen for inhibitors of EBNA-1: fluorescence polarization-based biochemical high throughput dose response assay to identify inhibitors of the Epstein-Barr virus-encoded protein, ZTA PubChem Bioassay (2010)[AID] 
Target
Name:
Trans-activator protein BZLF1
Synonyms:
BZLF1 PPP5C protein
Type:
Enzyme Catalytic Domain
Mol. Mass.:
26856.37
Organism:
Human herpesvirus 4
Description:
gi_82503229
Residue:
245
  
Inhibitor
Name:
BDBM62455
Synonyms:
(E)-3-phenyl-2-propenoic acid [2-[2-(4-morpholinyl)-5-(trifluoromethyl)anilino]-2-oxoethyl] ester MLS000391586 [2-[2-morpholin-4-yl-5-(trifluoromethyl)anilino]-2-oxoethyl] (E)-3-phenylprop-2-enoate cid_2366935
Type:
Small organic molecule
Emp. Form.:
C22H21F3N2O4
Mol. Mass.:
434.4083
SMILES:
FC(F)(F)c1ccc(N2CCOCC2)c(NC(=O)COC(=O)\C=C\c2ccccc2)c1
: