Target
Epstein-Barr nuclear antigen 1
Ligand
BDBM62436
Substrate
Meas. Tech.
Fluorescence polarization-based biochemical high throughput dose response assay for inhibitors of the Epstein-Barr virus nuclear antigen 1 (EBNA-1)
IC50
6283±n/a nM
Citation
 PubChem, PC Fluorescence polarization-based biochemical high throughput dose response assay for inhibitors of the Epstein-Barr virus nuclear antigen 1 (EBNA-1) PubChem Bioassay (2010)[AID] 
Target
Name:
Epstein-Barr nuclear antigen 1
Synonyms:
EBNA-1 protein EBNA1_EBVB9 | Epstein-Barr virus protease (EBV Pr)
Type:
Enzyme Catalytic Domain
Mol. Mass.:
56444.81
Organism:
Human herpesvirus 4
Description:
gi_23893623
Residue:
641
  
Inhibitor
Name:
BDBM62436
Synonyms:
(E)-3-(4-methoxyphenyl)-2-propenoic acid [3-[[[2-(2,6-dimethylphenoxy)-1-oxoethyl]hydrazinylidene]methyl]phenyl] ester 3-(4-Methoxy-phenyl)-acrylic acid 3-{[2-(2,6-dimethyl-phenoxy)-acetyl]-hydrazonomethyl}-phenyl ester SMR000174240 [3-[[[2-(2,6-dimethylphenoxy)acetyl]hydrazinylidene]methyl]phenyl] (E)-3-(4-methoxyphenyl)prop-2-enoate | cid_1138540
Type:
Small organic molecule
Emp. Form.:
C27H26N2O5
Mol. Mass.:
458.5057
SMILES:
COc1ccc(\C=C\C(=O)Oc2cccc(C=NNC(=O)COc3c(C)cccc3C)c2)cc1
: