Target
Epstein-Barr nuclear antigen 1
Ligand
BDBM62445
Substrate
Meas. Tech.
Fluorescence polarization-based biochemical high throughput dose response assay for inhibitors of the Epstein-Barr virus nuclear antigen 1 (EBNA-1)
IC50
15092±n/a nM
Citation
 PubChem, PC Fluorescence polarization-based biochemical high throughput dose response assay for inhibitors of the Epstein-Barr virus nuclear antigen 1 (EBNA-1) PubChem Bioassay (2010)[AID] 
Target
Name:
Epstein-Barr nuclear antigen 1
Synonyms:
EBNA-1 protein EBNA1_EBVB9 | Epstein-Barr virus protease (EBV Pr)
Type:
Enzyme Catalytic Domain
Mol. Mass.:
56444.81
Organism:
Human herpesvirus 4
Description:
gi_23893623
Residue:
641
  
Inhibitor
Name:
BDBM62445
Synonyms:
MLS000553586 N-[4-[2-(4-hydroxyphenyl)-1,3-diketo-isoindolin-5-yl]oxyphenyl]thiophene-2-carboxamide N-[4-[[2-(4-hydroxyphenyl)-1,3-dioxo-5-isoindolyl]oxy]phenyl]-2-thiophenecarboxamide Thiophene-2-carboxylic acid {4-[2-(4-hydroxy-phenyl)-1,3-dioxo-2,3-dihydro-1H-isoindol-5-yloxy]-phenyl}-amide | cid_1107365
Type:
Small organic molecule
Emp. Form.:
C25H16N2O5S
Mol. Mass.:
456.47
SMILES:
Oc1ccc(cc1)N1C(=O)c2ccc(Oc3ccc(NC(=O)c4cccs4)cc3)cc2C1=O
: