Target
Epstein-Barr nuclear antigen 1
Ligand
BDBM62466
Substrate
Meas. Tech.
Fluorescence polarization-based biochemical high throughput dose response assay for inhibitors of the Epstein-Barr virus nuclear antigen 1 (EBNA-1)
IC50
147783±n/a nM
Citation
 PubChem, PC Fluorescence polarization-based biochemical high throughput dose response assay for inhibitors of the Epstein-Barr virus nuclear antigen 1 (EBNA-1) PubChem Bioassay (2010)[AID] 
Target
Name:
Epstein-Barr nuclear antigen 1
Synonyms:
EBNA-1 protein EBNA1_EBVB9 | Epstein-Barr virus protease (EBV Pr)
Type:
Enzyme Catalytic Domain
Mol. Mass.:
56444.81
Organism:
Human herpesvirus 4
Description:
gi_23893623
Residue:
641
  
Inhibitor
Name:
BDBM62466
Synonyms:
MLS000123991 N-[4-[4-[(5,6-dimethyl-4-oxidanylidene-3H-thieno[2,3-d]pyrimidin-2-yl)methyl]piperazin-1-yl]sulfonylphenyl]ethanamide N-[4-[[4-[(5,6-dimethyl-4-oxo-3H-thieno[2,3-d]pyrimidin-2-yl)methyl]-1-piperazinyl]sulfonyl]phenyl]acetamide SMR000124428 | cid_3214708
Type:
Small organic molecule
Emp. Form.:
C21H25N5O4S2
Mol. Mass.:
475.584
SMILES:
CC(=O)Nc1ccc(cc1)S(=O)(=O)N1CCN(Cc2nc3sc(C)c(C)c3c(=O)[nH]2)CC1
: