Target
Heat shock factor protein 1
Ligand
BDBM62560
Substrate
Meas. Tech.
Luminescence Cell-Based Dose Confimation HTS to Identify Inhibitors of Heat Shock Factor 1 (HSF1)
EC50
>195000±0 nM
Citation
 PubChem, PC Luminescence Cell-Based Dose Confimation HTS to Identify Inhibitors of Heat Shock Factor 1 (HSF1) PubChem Bioassay (2010)[AID] 
Target
Name:
Heat shock factor protein 1
Synonyms:
HSF1_MOUSE Hsf1 protein
Type:
Enzyme Catalytic Domain
Mol. Mass.:
57208.68
Organism:
Mus musculus
Description:
P38532
Residue:
525
  
Inhibitor
Name:
BDBM62560
Synonyms:
6,8-Dimethyl-3-{(4-methyl-piperidin-1-yl)-[1-(tetrahydro-furan-2-ylmethyl)-1H-tetrazol-5-yl]-methyl}-1H-quinolin-2-one 6,8-dimethyl-3-[(4-methylpiperidin-1-yl)-[1-(oxolan-2-ylmethyl)-1,2,3,4-tetrazol-5-yl]methyl]-1H-quinolin-2-one 6,8-dimethyl-3-[(4-methylpiperidino)-[1-(tetrahydrofurfuryl)tetrazol-5-yl]methyl]carbostyril SMR000002471 | cid_652268
Type:
Small organic molecule
Emp. Form.:
C24H32N6O2
Mol. Mass.:
436.5499
SMILES:
CC1CCN(CC1)C(c1nnnn1CC1CCCO1)c1cc2cc(C)cc(C)c2[nH]c1=O
: