Target
Heat shock factor protein 1
Ligand
BDBM51545
Substrate
Meas. Tech.
Luminescence Cell-Based Dose Confimation HTS to Identify Inhibitors of Heat Shock Factor 1 (HSF1)
EC50
>195000±0 nM
Citation
 PubChem, PC Luminescence Cell-Based Dose Confimation HTS to Identify Inhibitors of Heat Shock Factor 1 (HSF1) PubChem Bioassay (2010)[AID] 
Target
Name:
Heat shock factor protein 1
Synonyms:
HSF1_MOUSE Hsf1 protein
Type:
Enzyme Catalytic Domain
Mol. Mass.:
57208.68
Organism:
Mus musculus
Description:
P38532
Residue:
525
  
Inhibitor
Name:
BDBM51545
Synonyms:
1-keto-N-(3-pyridyl)isochromene-4-carboxamide 1-oxo-N-(3-pyridinyl)-2-benzopyran-4-carboxamide 1-oxo-N-pyridin-3-ylisochromene-4-carboxamide SMR000021728 | cid_3238140
Type:
Small organic molecule
Emp. Form.:
C15H10N2O3
Mol. Mass.:
266.2515
SMILES:
O=C(Nc1cccnc1)c1coc(=O)c2ccccc12
: