Target
Heat shock factor protein 1
Ligand
BDBM62719
Substrate
Meas. Tech.
Luminescence Cell-Based Dose Confimation HTS to Identify Inhibitors of Heat Shock Factor 1 (HSF1)
EC50
>195000±0 nM
Citation
 PubChem, PC Luminescence Cell-Based Dose Confimation HTS to Identify Inhibitors of Heat Shock Factor 1 (HSF1) PubChem Bioassay (2010)[AID] 
Target
Name:
Heat shock factor protein 1
Synonyms:
HSF1_MOUSE Hsf1 protein
Type:
Enzyme Catalytic Domain
Mol. Mass.:
57208.68
Organism:
Mus musculus
Description:
P38532
Residue:
525
  
Inhibitor
Name:
BDBM62719
Synonyms:
1-[2-(3-phenoxyphenoxy)ethyl]-1,2,4-triazole MLS000063553 cid_976109
Type:
Small organic molecule
Emp. Form.:
C16H15N3O2
Mol. Mass.:
281.3092
SMILES:
C(Cn1cncn1)Oc1cccc(Oc2ccccc2)c1
: