Target
Heat shock factor protein 1
Ligand
BDBM62850
Substrate
Meas. Tech.
Luminescence Cell-Based Dose Confimation HTS to Identify Inhibitors of Heat Shock Factor 1 (HSF1)
EC50
>195000±0 nM
Citation
 PubChem, PC Luminescence Cell-Based Dose Confimation HTS to Identify Inhibitors of Heat Shock Factor 1 (HSF1) PubChem Bioassay (2010)[AID] 
Target
Name:
Heat shock factor protein 1
Synonyms:
HSF1_MOUSE Hsf1 protein
Type:
Enzyme Catalytic Domain
Mol. Mass.:
57208.68
Organism:
Mus musculus
Description:
P38532
Residue:
525
  
Inhibitor
Name:
BDBM62850
Synonyms:
2-(2-phenoxyethylsulfanyl)-1,3-benzoxazole MLS000107866 cid_2258754
Type:
Small organic molecule
Emp. Form.:
C15H13NO2S
Mol. Mass.:
271.334
SMILES:
C(CSc1nc2ccccc2o1)Oc1ccccc1
: