Target
Heat shock factor protein 1
Ligand
BDBM63363
Substrate
Meas. Tech.
Luminescence Cell-Based Dose Confimation HTS to Identify Inhibitors of Heat Shock Factor 1 (HSF1)
EC50
>195000±0 nM
Citation
 PubChem, PC Luminescence Cell-Based Dose Confimation HTS to Identify Inhibitors of Heat Shock Factor 1 (HSF1) PubChem Bioassay (2010)[AID] 
Target
Name:
Heat shock factor protein 1
Synonyms:
HSF1_MOUSE Hsf1 protein
Type:
Enzyme Catalytic Domain
Mol. Mass.:
57208.68
Organism:
Mus musculus
Description:
P38532
Residue:
525
  
Inhibitor
Name:
BDBM63363
Synonyms:
2-methyl-N,3-diphenyl-propanamide 2-methyl-N,3-diphenylpropanamide SMR000389058 | cid_316235
Type:
Small organic molecule
Emp. Form.:
C16H17NO
Mol. Mass.:
239.3123
SMILES:
CC(Cc1ccccc1)C(=O)Nc1ccccc1
: