Target
Serine/threonine-protein phosphatase PP1-alpha catalytic subunit
Ligand
BDBM61173
Substrate
Meas. Tech.
Counterscreen for inhibitors of PP5: fluorescence-based biochemical high throughput dose response assay for inhibitors of Protein Phosphatase 1 (PP1)
IC50
67047±n/a nM
Citation
 PubChem, PC Counterscreen for inhibitors of PP5: fluorescence-based biochemical high throughput dose response assay for inhibitors of Protein Phosphatase 1 (PP1) PubChem Bioassay (2010)[AID] 
Target
Name:
Serine/threonine-protein phosphatase PP1-alpha catalytic subunit
Synonyms:
PP-1A PPP1A Serine/threonine protein phosphatase PP1-alpha catalytic subunit protein phosphatase 1, catalytic subunit, alpha isoform 3
Type:
PROTEIN
Mol. Mass.:
37510.66
Organism:
Homo sapiens (Human)
Description:
ChEMBL_197827
Residue:
330
  
Inhibitor
Name:
BDBM61173
Synonyms:
3'-(4-chlorophenyl)spiro[indane-2,2'-oxirane]-1,3-quinone MLS000567016 cid_3142215
Type:
Small organic molecule
Emp. Form.:
C16H9ClO3
Mol. Mass.:
284.694
SMILES:
Clc1ccc(cc1)C1OC11C(=O)c2ccccc2C1=O
: