Target
Serine/threonine-protein phosphatase PP1-alpha catalytic subunit
Ligand
BDBM64796
Substrate
Meas. Tech.
Counterscreen for inhibitors of PP5: fluorescence-based biochemical high throughput dose response assay for inhibitors of Protein Phosphatase 1 (PP1)
IC50
67047±n/a nM
Citation
 PubChem, PC Counterscreen for inhibitors of PP5: fluorescence-based biochemical high throughput dose response assay for inhibitors of Protein Phosphatase 1 (PP1) PubChem Bioassay (2010)[AID] 
Target
Name:
Serine/threonine-protein phosphatase PP1-alpha catalytic subunit
Synonyms:
PP-1A PPP1A Serine/threonine protein phosphatase PP1-alpha catalytic subunit protein phosphatase 1, catalytic subunit, alpha isoform 3
Type:
PROTEIN
Mol. Mass.:
37510.66
Organism:
Homo sapiens (Human)
Description:
ChEMBL_197827
Residue:
330
  
Inhibitor
Name:
BDBM64796
Synonyms:
MLS000861878 N-(2-hydroxy-1,3-dioxo-2-indenyl)-4-(trifluoromethyl)benzamide N-[2-oxidanyl-1,3-bis(oxidanylidene)inden-2-yl]-4-(trifluoromethyl)benzamide SMR000460662 | cid_2732881
Type:
Small organic molecule
Emp. Form.:
C17H10F3NO4
Mol. Mass.:
349.2608
SMILES:
OC1(NC(=O)c2ccc(cc2)C(F)(F)F)C(=O)c2ccccc2C1=O
: