Target
Serine/threonine-protein phosphatase
Ligand
BDBM64776
Substrate
Meas. Tech.
Fluorescence-based biochemical high throughput dose response assay for inhibitors of Protein Phosphatase 5 (PP5)
IC50
13413±n/a nM
Citation
 PubChem, PC Fluorescence-based biochemical high throughput dose response assay for inhibitors of Protein Phosphatase 5 (PP5) PubChem Bioassay (2010)[AID] 
Target
Name:
Serine/threonine-protein phosphatase
Synonyms:
H0YDU8_HUMAN PPP5C protein
Type:
Enzyme Catalytic Domain
Mol. Mass.:
55092.68
Organism:
Homo sapiens (Human)
Description:
gi_37589898
Residue:
484
  
Inhibitor
Name:
BDBM64776
Synonyms:
2-Amino-1-(3-methyl-butyl)-1H-pyrrolo[2,3-b]quinoxaline-3-carboxylic acid (2-methoxy-ethyl)-amide 2-amino-N-(2-methoxyethyl)-1-(3-methylbutyl)-3-pyrrolo[3,2-b]quinoxalinecarboxamide 2-azanyl-N-(2-methoxyethyl)-1-(3-methylbutyl)pyrrolo[3,2-b]quinoxaline-3-carboxamide SMR000149370 | cid_2031291
Type:
Small organic molecule
Emp. Form.:
C19H25N5O2
Mol. Mass.:
355.4341
SMILES:
COCCNC(=O)c1c(N)n(CCC(C)C)c2nc3ccccc3nc12
: