Target
Serine/threonine-protein phosphatase
Ligand
BDBM64796
Substrate
Meas. Tech.
Fluorescence-based biochemical high throughput dose response assay for inhibitors of Protein Phosphatase 5 (PP5)
IC50
827.75±n/a nM
Citation
 PubChem, PC Fluorescence-based biochemical high throughput dose response assay for inhibitors of Protein Phosphatase 5 (PP5) PubChem Bioassay (2010)[AID] 
Target
Name:
Serine/threonine-protein phosphatase
Synonyms:
H0YDU8_HUMAN PPP5C protein
Type:
Enzyme Catalytic Domain
Mol. Mass.:
55092.68
Organism:
Homo sapiens (Human)
Description:
gi_37589898
Residue:
484
  
Inhibitor
Name:
BDBM64796
Synonyms:
MLS000861878 N-(2-hydroxy-1,3-dioxo-2-indenyl)-4-(trifluoromethyl)benzamide N-[2-oxidanyl-1,3-bis(oxidanylidene)inden-2-yl]-4-(trifluoromethyl)benzamide SMR000460662 | cid_2732881
Type:
Small organic molecule
Emp. Form.:
C17H10F3NO4
Mol. Mass.:
349.2608
SMILES:
OC1(NC(=O)c2ccc(cc2)C(F)(F)F)C(=O)c2ccccc2C1=O
: