Target
G-protein coupled receptor 55
Ligand
BDBM64819
Substrate
Meas. Tech.
SAR Analysis of Selective Antagonists of GPR55 using an Image-Based Assay
IC50
4950±n/a nM
Citation
 PubChem, PC SAR Analysis of Selective Antagonists of GPR55 using an Image-Based Assay PubChem Bioassay (2010)[AID] 
Target
Name:
G-protein coupled receptor 55
Synonyms:
G protein-coupled receptor 55 GPR55_HUMAN
Type:
PROTEIN
Mol. Mass.:
36649.72
Organism:
Homo sapiens (Human)
Description:
ChEMBL_1292265
Residue:
319
  
Inhibitor
Name:
BDBM64819
Synonyms:
MLS-0359029.0001 N-(2,3-dihydro-1,4-benzodioxin-6-yl)-5-methyl-4-(2-methylpiperidin-1-yl)thieno[2,3-d]pyrimidine-6-carboxamide cid_4120034
Type:
Small organic molecule
Emp. Form.:
C22H24N4O3S
Mol. Mass.:
424.516
SMILES:
CC1CCCCN1c1ncnc2sc(C(=O)Nc3ccc4OCCOc4c3)c(C)c12
: